Re: Compilation issues

Geoff Burling (llywrch@agora.rdrop.com)
Sat, 8 Jun 2002 22:38:07 -0700 (PDT)


On 9 Jun 2002, Frank Gore wrote:

> I realize this probably isn't the place to be asking about this, but
> I've been trying to get the afterstep-devel CVS build to compile for
> months now without any success. I'm constantly syncing with the CVS
> build, hoping that *this* time will be the one where it finally
> compiles. But no such luck :( It always messes up with the exact same
> error:
>
> ================
> In file included from Compiler/lexin:3:
> types.h:36: ../../include/resources.h: No such file or directory
> make[1]: *** [lex.yy.o] Error 1
> make[1]: Leaving directory
> `/home/gore/src/afterstep/as-install/src/Script'
> make: *** [all] Error 1
> ================
>
> I've tried everything I can think of to get this thing compiled, but
> without success. Can someone PLEASE tell me what I'm doing wrong? How
> can every single CVS build since March not be able to compile?
>
In a word, afterstep-devel doesn't compile. Sasha confirmed this in an
email to me back in March, indicating that it would take a lot of work
to make it compile.

Meanwhile, has anyone had success compiling the afterstep-stable snapshop?
I've tried a new version of XFree86, & different revs of gcc. Next to try
is compiling & installing libAfter first, then run the compile.

The compile bombs consistently for me at:

make[1]: Entering directory `/u3/afterstep-stable/src/Script/Widgets'
make[1]: Nothing to be done for `all'.
make[1]: Leaving directory `/u3/afterstep-stable/src/Script/Widgets'
make[1]: Entering directory `/u3/afterstep-stable/src/Script'
gcc -O2  -Wall  -I.. -I../..  -I/usr/X11R6/include  -I. -c libyywrap.c
gcc -O2  -Wall  -I.. -I../..  -I/usr/X11R6/include  -I. -c lex.yy.c
gcc -O2  -Wall  -I.. -I../..  -I/usr/X11R6/include  -I. -c y.tab.c
gcc -O2  -Wall  -I.. -I../..  -I/usr/X11R6/include  -I. -c Instructions.c
gcc -O2  -Wall  -I.. -I../..  -I/usr/X11R6/include  -I. -c Script.c
make[1]: *** No rule to make target `../Script/Widgets/libWidgets.a', needed by
`Script'.  Stop.
make[1]: Leaving directory `/u3/afterstep-stable/src/Script'
make: *** [all] Error 1

I've reported the problem to Sasha, but it hasn't been fixed. Am I missing
something on my computer?

Geoff



_______________________________________________
The AfterStep Window Manager for X User's Mailing List
http://mail.afterstep.org/mailman/listinfo/as-users