Ok, so just one more bug :)

Bartosz Wucke (sharp@solutions.net.pl)
Wed, 30 Jul 2003 21:07:24 +0200




With Baloons this time.
Balloons appearing over applications work as part of desktop - holes in the 
application, so if I click on one, I get afterstep menu instead of the item 
that was covered by it, as if I clicked on the desktop, not the window.

Ok, so here's the other one, I tried to enable all my debug in compilation and...
afterstep-stable# ./configure --with-x --enable-script 
--enable-mmx-optimization --enable-trace-x --enable-trace --enable-audit 
--enable-gprof --enable-warn --enable-sigsegv --enable-gdb --with-libefence 
--enable-fixeditems --enable-i18n --with-desktops=1
(...)

#make
(...)

gcc -O2  -Wall -fPIC -g -pg -Wuninitialized -Wwrite-strings -Wcast-qual 
-Wbad-function-cast -Wpointer-arith -Wstrict-prototypes -Wmissing-prototypes 
-Wmissing-declarations -Wnested-externs -Wconversion -Wcomment -Wcast-align 
-Winline -Wshadow -Wredundant-decls -Wid-clash-31  -I/usr/X11R6/include   -c 
parse.c
In file included from parse.c:27:
ashash.h:107: warning: function declaration isn't a prototype
In file included from parse.c:29:
safemalloc.h:19: warning: function declaration isn't a prototype
In file included from parse.c:33:
output.h:15: warning: function declaration isn't a prototype
output.h:23: warning: function declaration isn't a prototype
output.h:39: warning: function declaration isn't a prototype
In file included from parse.c:36:
/usr/include/stdlib.h:527: parse error before `__FUNCTION__'
/usr/include/stdlib.h:527: warning: redundant redeclaration of `countmalloc' in 
same scope
audit.h:96: warning: previous declaration of `countmalloc'
/usr/include/stdlib.h:529: parse error before `__FUNCTION__'
/usr/include/stdlib.h:530: warning: redundant redeclaration of `countcalloc' in 
same scope
audit.h:97: warning: previous declaration of `countcalloc'
/usr/include/stdlib.h:536: parse error before `__FUNCTION__'
/usr/include/stdlib.h:536: warning: redundant redeclaration of `countrealloc' 
in same scope
audit.h:98: warning: previous declaration of `countrealloc'
/usr/include/stdlib.h:538: parse error before `__FUNCTION__'
/usr/include/stdlib.h:538: warning: redundant redeclaration of `countfree' in 
same scope
audit.h:99: warning: previous declaration of `countfree'
/usr/include/stdlib.h:542: warning: redundant redeclaration of `cfree' in same 
scope
/usr/include/malloc.h:137: warning: previous declaration of `cfree'
In file included from parse.c:36:
/usr/include/stdlib.h:551: warning: redundant redeclaration of `valloc' in same 
scope
/usr/include/malloc.h:143: warning: previous declaration of `valloc'
parse.c: In function `register_custom_color':
parse.c:49: warning: passing arg 1 of `create_ashash' with different width due 
to prototype
parse.c:55: warning: cast does not match function type
parse.c: At top level:
parse.c:88: warning: no previous prototype for `parse_argb_part'
parse.c: In function `parse_argb_part':
parse.c:91: warning: cast discards qualifiers from pointer target type
parse.c: At top level:
parse.c:248: warning: no previous prototype for `parse_hsv_part'
parse.c: In function `parse_hsv_part':
parse.c:251: warning: cast discards qualifiers from pointer target type
parse.c:276: warning: passing arg 1 of `parse_rgb2hsv' with different width due 
to prototype
parse.c:276: warning: passing arg 2 of `parse_rgb2hsv' with different width due 
to prototype
parse.c:276: warning: passing arg 3 of `parse_rgb2hsv' with different width due 
to prototype
parse.c:284: warning: passing arg 1 of `parse_hsv2rgb8' as unsigned due to 
prototype
parse.c:284: warning: passing arg 2 of `parse_hsv2rgb8' as unsigned due to 
prototype
parse.c:284: warning: passing arg 3 of `parse_hsv2rgb8' as unsigned due to 
prototype
parse.c: At top level:
parse.c:297: warning: no previous prototype for `parse_argb_dec'
parse.c: In function `parse_argb_dec':
parse.c:301: warning: cast discards qualifiers from pointer target type
parse.c: In function `parse_argb_color':
parse.c:461: warning: cast discards qualifiers from pointer target type
parse.c: In function `stripcpy2':
parse.c:537: warning: cast discards qualifiers from pointer target type
parse.c: In function `parse_token':
parse.c:707: warning: cast discards qualifiers from pointer target type
parse.c: In function `parse_tab_token':
parse.c:718: warning: cast discards qualifiers from pointer target type
parse.c: In function `parse_filename':
parse.c:734: warning: cast discards qualifiers from pointer target type
parse.c: At top level:
parse.c:740: warning: no previous prototype for `parse_signed_int'
parse.c: In function `string_from_int':
parse.c:864: warning: passing arg 3 of `countmalloc' as unsigned due to prototype
parse.c: In function `comma_string2list':
parse.c:990: warning: passing arg 3 of `countcalloc' as unsigned due to prototype
parse.c: In function `list2comma_string':
parse.c:1021: warning: passing arg 3 of `countmalloc' as unsigned due to prototype
parse.c: In function `make_tricky_text':
parse.c:1072: warning: passing arg 3 of `countmalloc' as unsigned due to prototype
make[2]: *** [parse.o] Error 1
make[2]: Leaving directory `/home/misc/afterstep-stable/libAfterBase'
make[1]: *** [../../libAfterBase/libAfterBase.a] Error 2
make[1]: Leaving directory `/home/misc/afterstep-stable/src/WinList2'
make: *** [all] Error 1

_______________________________________________
The AfterStep Window Manager for X User's Mailing List
http://mail.afterstep.org/mailman/listinfo/as-users